BDBM50078445 (S)-2-(Butane-1-sulfonylamino)-3-{[5-(2-piperidin-4-yl-ethyl)-thieno[3,2-b]thiophene-2-carbonyl]-amino}-propionic acid::CHEMBL312113
SMILES CCCCS(=O)(=O)N[C@@H](CNC(=O)c1cc2sc(CCC3CCNCC3)cc2s1)C(O)=O
InChI Key InChIKey=KFNHSIQLBWLFMH-INIZCTEOSA-N
Data  1 IC50  1 Kd
  Tab Delimited (TSV)   2D SDfile   Computed 3D by Vconf -m prep SDfile
Find this compound or compounds like it in BindingDB:
Activity Spreadsheet -- Enzyme Inhibition Constant Data from BindingDB
Found 2 hits for monomerid = 50078445
TargetIntegrin alpha-IIb/beta-3(Homo sapiens (Human))
Merck Research Laboratories
Curated by ChEMBL
LigandPNGBDBM50078445((S)-2-(Butane-1-sulfonylamino)-3-{[5-(2-piperidin-...)
Affinity DataKd:  3nM. Assay description: Equilibrium dissociation constant was measured from displacement of L-762,745 from Fibrinogen receptor of human platelets by flow cytometry
In DepthDetails ArticlePubMed
TargetIntegrin alpha-IIb/beta-3(Homo sapiens (Human))
Merck Research Laboratories
Curated by ChEMBL
LigandPNGBDBM50078445((S)-2-(Butane-1-sulfonylamino)-3-{[5-(2-piperidin-...)
Affinity DataIC50:  10nM. Assay description: The compound was tested in vivo for the inhibition of aggregation of human gel-filtered platelets(GFP)
In DepthDetails ArticlePubMed