BDBM50078541 CHEMBL3414949
SMILES NC(C1CCCCC1)P(O)(O)=O
InChI Key InChIKey=OOGDWWCJEPHBDQ-UHFFFAOYSA-N
Data  1 KI
PDB links: 1 PDB ID matches this monomer.
  Tab Delimited (TSV)   2D SDfile   Computed 3D by Vconf -m prep SDfile
Find this compound or compounds like it in BindingDB:
Activity Spreadsheet -- Enzyme Inhibition Constant Data from BindingDB
Found 1 hit for monomerid = 50078541
TargetMethionine aminopeptidase 1(Homo sapiens (Human))
Csir-Indian Institute Of Chemical Technology
Curated by ChEMBL
LigandPNGBDBM50078541(CHEMBL3414949)
Affinity DataKi: >5.00E+5nM. Assay description: Inhibition of Human MetAP1b using Met-pNA as substrate