BDBM50078565 (S)-2-[(Biphenyl-4-sulfonyl)-isobutyl-amino]-N-hydroxy-4-methylsulfanyl-butyramide::CHEMBL47728
SMILES CSCC[C@H](N(CC(C)C)S(=O)(=O)c1ccc(cc1)-c1ccccc1)C(=O)NO
InChI Key InChIKey=XXNCZTSFXIANIO-FQEVSTJZSA-N
Data  5 IC50
  Tab Delimited (TSV)   2D SDfile   Computed 3D by Vconf -m prep SDfile
Find this compound or compounds like it in BindingDB:
Activity Spreadsheet -- Enzyme Inhibition Constant Data from BindingDB
Found 5 hits for monomerid = 50078565
TargetCollagenase 3(Homo sapiens (Human))
Universit£
Curated by ChEMBL
LigandPNGBDBM50078565((S)-2-[(Biphenyl-4-sulfonyl)-isobutyl-amino]-N-hyd...)
Affinity DataIC50:  3nM. Assay description: Inhibition of matrix metalloprotease-13
In DepthDetails ArticlePubMed
TargetInterstitial collagenase(Homo sapiens (Human))
Universit£
Curated by ChEMBL
LigandPNGBDBM50078565((S)-2-[(Biphenyl-4-sulfonyl)-isobutyl-amino]-N-hyd...)
Affinity DataIC50:  156nM. Assay description: Inhibition of matrix metalloprotease-1
In DepthDetails ArticlePubMed
TargetMatrix metalloproteinase-9(Homo sapiens (Human))
Universit£
Curated by ChEMBL
LigandPNGBDBM50078565((S)-2-[(Biphenyl-4-sulfonyl)-isobutyl-amino]-N-hyd...)
Affinity DataIC50:  0.200nM. Assay description: Inhibition of matrix metalloprotease-9
In DepthDetails ArticlePubMed
TargetStromelysin-1(Homo sapiens (Human))
Universit£
Curated by ChEMBL
LigandPNGBDBM50078565((S)-2-[(Biphenyl-4-sulfonyl)-isobutyl-amino]-N-hyd...)
Affinity DataIC50:  37nM. Assay description: Inhibition of matrix metalloprotease-3
In DepthDetails ArticlePubMed
Target72 kDa type IV collagenase(Homo sapiens (Human))
Universit£
Curated by ChEMBL
LigandPNGBDBM50078565((S)-2-[(Biphenyl-4-sulfonyl)-isobutyl-amino]-N-hyd...)
Affinity DataIC50:  0.700nM. Assay description: Inhibition of matrix metalloprotease-2
In DepthDetails ArticlePubMed