BDBM50078575 CHEMBL3414957
SMILES O=C(CN1CCCCC1)N1CCN(CC1)C1(C2CC3CC(C2)CC1C3)c1ccccc1
InChI Key InChIKey=FWWSZUFJAOWGCT-UHFFFAOYSA-N
Data  1 IC50
  Tab Delimited (TSV)   2D SDfile   Computed 3D by Vconf -m prep SDfile
Find this compound or compounds like it in BindingDB:
Activity Spreadsheet -- Enzyme Inhibition Constant Data from BindingDB
Found 1 hit for monomerid = 50078575
TargetSigma non-opioid intracellular receptor 1(Homo sapiens (Human))
University Of Athens
Curated by ChEMBL
LigandPNGBDBM50078575(CHEMBL3414957)
Affinity DataIC50:  135nM. Assay description: Displacement of [3H]-(+)-pentazocine from sigma-1 receptor in human Jurkat cell membrane by liquid scintillation spectrometry
In DepthDetails ArticlePubMed