BDBM50078634 CHEMBL4743261
SMILES Cc1cn(Cn2cnc(-c3cnn(C)c3)c2-c2ccc(cc2)[N+]([O-])=O)nn1
InChI Key InChIKey=GTOATASLSLQVCO-UHFFFAOYSA-N
Data  1 EC50
  Tab Delimited (TSV)   2D SDfile   Computed 3D by Vconf -m prep SDfile
Find this compound or compounds like it in BindingDB:
Activity Spreadsheet -- Enzyme Inhibition Constant Data from BindingDB
Found 1 hit for monomerid = 50078634
TargetMetabotropic glutamate receptor 4(Homo sapiens (Human))
Vanderbilt University
Curated by ChEMBL
LigandPNGBDBM50078634(CHEMBL4743261)
Affinity DataEC50:  1.36E+3nM. Assay description: Displacement of [3H]-Ro-15-4513 from GABA-A receptor alpha-6-beta-2-gamma-2 subunits expressed in Sf9 cells
In DepthDetails ArticlePubMed