BDBM50078863 CHEMBL3416180
SMILES CCCCCCCCC1=C(OC)C(=O)C=C(OC)C1=O
InChI Key InChIKey=HKKNMPGLOUIVOX-UHFFFAOYSA-N
Data  4 IC50
  Tab Delimited (TSV)   2D SDfile   Computed 3D by Vconf -m prep SDfile
Find this compound or compounds like it in BindingDB:
Activity Spreadsheet -- Enzyme Inhibition Constant Data from BindingDB
Found 4 hits for monomerid = 50078863
TargetPolyunsaturated fatty acid 5-lipoxygenase(Homo sapiens (Human))
University Of Naples
Curated by ChEMBL
LigandPNGBDBM50078863(CHEMBL3416180)
Affinity DataIC50:  320nM. Assay description: Inhibition of 5-LOX in A23187-stimulated human blood PMNL assessed as reduction in lipoxygenase products formation pre-incubated for 15 mins followed...
In DepthDetails ArticlePubMed
TargetMacrophage-expressed gene 1 protein(Homo sapiens (Human))
University Of Naples
Curated by ChEMBL
LigandPNGBDBM50078863(CHEMBL3416180)
Affinity DataIC50: >1.00E+4nM. Assay description: Inhibition of mPGES1 in IL-1beta stimulated human A549 cell microsomal membranes assessed as reduction in PGE2 synthase activity after 15 mins using ...
In DepthDetails ArticlePubMed
TargetPolyunsaturated fatty acid 5-lipoxygenase(Homo sapiens (Human))
University Of Naples
Curated by ChEMBL
LigandPNGBDBM50078863(CHEMBL3416180)
Affinity DataIC50:  570nM. Assay description: Inhibition of 5-LOX in A23187-stimulated human blood PMNL assessed as reduction in lipoxygenase products formation in presence of arachidonic acid pr...
In DepthDetails ArticlePubMed
TargetPolyunsaturated fatty acid 5-lipoxygenase(Homo sapiens (Human))
University Of Naples
Curated by ChEMBL
LigandPNGBDBM50078863(CHEMBL3416180)
Affinity DataIC50:  1.20E+3nM. Assay description: Inhibition of human recombinant 5-LOX expressed in Escherichia coli BL21 incubated for 10 mins in presence of arachidonic acid by RP-HPLC based cell-...
In DepthDetails ArticlePubMed