BDBM50079177 5-Methyl-1-(1-phenethyl-piperidin-4-yl)-4-phenyl-1,3-dihydro-imidazol-2-one::CHEMBL91229
SMILES Cc1c([nH]c(=O)n1C1CCN(CCc2ccccc2)CC1)-c1ccccc1
InChI Key InChIKey=GIYXEZZPINFSPU-UHFFFAOYSA-N
Data  3 KI
  Tab Delimited (TSV)   2D SDfile   Computed 3D by Vconf -m prep SDfile
Find this compound or compounds like it in BindingDB:
Activity Spreadsheet -- Enzyme Inhibition Constant Data from BindingDB
Found 3 hits for monomerid = 50079177
TargetD(4) dopamine receptor(Homo sapiens (Human))
Merck Sharp And Dohme Research Laboratories
Curated by ChEMBL
LigandPNGBDBM50079177(5-Methyl-1-(1-phenethyl-piperidin-4-yl)-4-phenyl-1...)
Affinity DataKi:  0.560nM. Assay description: Affinity to displace [3H]-spiperone from cloned human Dopamine receptor D4 stably expressed in HEK-393 cell lines
In DepthDetails ArticlePubMed
TargetD(2) dopamine receptor(Homo sapiens (Human))
Merck Sharp And Dohme Research Laboratories
Curated by ChEMBL
LigandPNGBDBM50079177(5-Methyl-1-(1-phenethyl-piperidin-4-yl)-4-phenyl-1...)
Affinity DataKi:  220nM. Assay description: Affinity to displace [3H]-spiperone from cloned human Dopamine receptor D2 stably expressed in CHO cell lines
In DepthDetails ArticlePubMed
TargetD(3) dopamine receptor(Homo sapiens (Human))
Merck Sharp And Dohme Research Laboratories
Curated by ChEMBL
LigandPNGBDBM50079177(5-Methyl-1-(1-phenethyl-piperidin-4-yl)-4-phenyl-1...)
Affinity DataKi: >3.20E+3nM. Assay description: Affinity to displace [3H]-spiperone from cloned human Dopamine receptor D3 (hD3) stably expressed in HEK-393 cell lines
In DepthDetails ArticlePubMed