BDBM50079538 CHEMBL3417460
SMILES CN(C)CCCCOC(=O)Nc1cccc(Cn2nc(Nc3ccccc3C)ccc2=O)c1
InChI Key InChIKey=XETMKXVHOVFJKY-UHFFFAOYSA-N
Data  1 IC50
  Tab Delimited (TSV)   2D SDfile   Computed 3D by Vconf -m prep SDfile
Find this compound or compounds like it in BindingDB:
Activity Spreadsheet -- Enzyme Inhibition Constant Data from BindingDB
Found 1 hit for monomerid = 50079538
TargetHepatocyte growth factor receptor(Homo sapiens (Human))
Chinese Academy Of Sciences
Curated by ChEMBL
LigandPNGBDBM50079538(CHEMBL3417460)
Affinity DataIC50:  1.00E+3nM. Assay description: Inhibition of recombinant c-Met (unknown origin) using poly (Glu,Tyr)4:1 substrate incubated for 60 mins by ELISA method
In DepthDetails ArticlePubMed