BDBM50079635 CHEMBL3414760
SMILES COc1ccc(cc1NC(=O)\C=C/C(O)=O)C(N)=O
InChI Key InChIKey=BHTWOIYWJWZADO-PLNGDYQASA-N
Data  2 IC50
  Tab Delimited (TSV)   2D SDfile   Computed 3D by Vconf -m prep SDfile
Find this compound or compounds like it in BindingDB:
Activity Spreadsheet -- Enzyme Inhibition Constant Data from BindingDB
Found 2 hits for monomerid = 50079635
TargetPoly [ADP-ribose] polymerase 1(Homo sapiens (Human))
Karolinska Institutet
Curated by ChEMBL
LigandPNGBDBM50079635(CHEMBL3414760)
Affinity DataIC50: >2.00E+4nM. Assay description: Inhibition of hexahistidine-tagged full length human recombinant ARTD1 expressed in Escherichia coli BL21(DE3) assessed as Inhibition of ADP-ribosylt...
In DepthDetails ArticlePubMed
TargetProtein mono-ADP-ribosyltransferase PARP10(Homo sapiens (Human))
Karolinska Institutet
Curated by ChEMBL
LigandPNGBDBM50079635(CHEMBL3414760)
Affinity DataIC50: >2.00E+4nM. Assay description: Inhibition of hexahistidine-tagged full length human recombinant ARTD10 expressed in Escherichia coli BL21(DE3) assessed as Inhibition of ADP-ribosyl...
In DepthDetails ArticlePubMed