BDBM50079778 12-(2-{4-[2-(3,4-Difluoro-phenyl)-2-hydroxy-ethoxy]-3-methoxy-cyclohexyl}-1-methyl-vinyl)-17-ethyl-1,14-dihydroxy-23,25-dimethoxy-13,19,21,27-tetramethyl-11,28-dioxa-4-aza-tricyclo[22.3.1.0*4,9*]octacos-18-ene-2,3,10,16-tetraone::CHEMBL65863
SMILES CC[C@@H]1\C=C(C)\C[C@H](C)C[C@H](OC)[C@H]2O[C@](O)([C@H](C)C[C@@H]2OC)C(=O)C(=O)N2CCCC[C@H]2C(=O)O[C@@H]([C@H](C)[C@H](O)CC1=O)C(\C)=C\C1CC[C@@H](OC[C@@H](O)c2ccc(F)c(F)c2)[C@@H](C1)OC
InChI Key InChIKey=CUWVOVSWQFVBOB-FEKPTRKQSA-N
Data  1 IC50  1 EC50
  Tab Delimited (TSV)   2D SDfile   Computed 3D by Vconf -m prep SDfile
Find this compound or compounds like it in BindingDB:
Activity Spreadsheet -- Enzyme Inhibition Constant Data from BindingDB
Found 2 hits for monomerid = 50079778
TargetProtein phosphatase 3 catalytic subunit alpha(Homo sapiens (Human))
Merck Research Laboratories
Curated by ChEMBL
LigandPNGBDBM50079778(12-(2-{4-[2-(3,4-Difluoro-phenyl)-2-hydroxy-ethoxy...)
Affinity DataIC50:  7.30nM. Assay description: Inhibitory activity against Calcineurin (CaN phosphatase)
In DepthDetails ArticlePubMed
TargetPeptidyl-prolyl cis-trans isomerase FKBP1A(Homo sapiens (Human))
Merck Research Laboratories
Curated by ChEMBL
LigandPNGBDBM50079778(12-(2-{4-[2-(3,4-Difluoro-phenyl)-2-hydroxy-ethoxy...)
Affinity DataEC50:  7.5nM. Assay description: Effective concentration against FK506 binding protein 12 using [3H]-dihydro FK-506
In DepthDetails ArticlePubMed