BDBM50079794 2-[1-[4-amino-5-sulfanyl-(E,4R)-2-pentenyl]-4-(4-trifluoromethylphenoxy)-(2S,4S)-tetrahydro-1H-2-pyrrolylcarboxamido]-4-methylsulfanyl-(2S)-butanoic acid with di( TFA)::CHEMBL303414
SMILES CSCC[C@H](NC(=O)[C@@H]1C[C@@H](CN1C\C=C\[C@@H](N)CS)Oc1ccc(cc1)C(F)(F)F)C(O)=O
InChI Key InChIKey=KWUCTFUKLSMZME-UZKGOIHCSA-N
Data  2 IC50
  Tab Delimited (TSV)   2D SDfile   Computed 3D by Vconf -m prep SDfile
Find this compound or compounds like it in BindingDB:
Activity Spreadsheet -- Enzyme Inhibition Constant Data from BindingDB
Found 2 hits for monomerid = 50079794
LigandPNGBDBM50079794(2-[1-[4-amino-5-sulfanyl-(E,4R)-2-pentenyl]-4-(4-t...)
Affinity DataIC50:  110nM. Assay description: In vitro inhibitory activity against Geranylgeranyl transferase in the geranylgeranylation of H-ras-CAIL protein
In DepthDetails ArticlePubMed
TargetProtein farnesyltransferase subunit beta/geranylgeranyltransferase type-1 subunit alpha(Bos taurus (bovine))
Eisai Research Institute
Curated by ChEMBL
LigandPNGBDBM50079794(2-[1-[4-amino-5-sulfanyl-(E,4R)-2-pentenyl]-4-(4-t...)
Affinity DataIC50:  110nM. Assay description: Inhibitory concentration was evaluated against Farnesyltransferase in the farnesylation of H-ras protein
In DepthDetails ArticlePubMed