BDBM50079806 2-[1-[4-amino-5-sulfanyl-(E,4R)-2-pentenyl]-4-(2-propylphenoxy)-(2S,4S)-tetrahydro-1H-2-pyrrolylcarboxamido]-4-methylsulfanyl-(2S)-butanoic acid with di( TFA)::CHEMBL305584
SMILES CCCc1ccccc1O[C@H]1C[C@H](N(C\C=C\[C@@H](N)CS)C1)C(=O)N[C@@H](CCSC)C(O)=O
InChI Key InChIKey=KCVLNHHETHSZOW-DWULMZAMSA-N
Data  2 IC50
  Tab Delimited (TSV)   2D SDfile   Computed 3D by Vconf -m prep SDfile
Find this compound or compounds like it in BindingDB:
Activity Spreadsheet -- Enzyme Inhibition Constant Data from BindingDB
Found 2 hits for monomerid = 50079806
TargetProtein farnesyltransferase subunit beta/geranylgeranyltransferase type-1 subunit alpha(Bos taurus (bovine))
Eisai Research Institute
Curated by ChEMBL
LigandPNGBDBM50079806(2-[1-[4-amino-5-sulfanyl-(E,4R)-2-pentenyl]-4-(2-p...)
Affinity DataIC50:  210nM. Assay description: Inhibitory concentration was evaluated against Farnesyltransferase in the farnesylation of H-ras protein
In DepthDetails ArticlePubMed
LigandPNGBDBM50079806(2-[1-[4-amino-5-sulfanyl-(E,4R)-2-pentenyl]-4-(2-p...)
Affinity DataIC50:  170nM. Assay description: Inhibitory concentration against Farnesyltransferase for Farnesylation of H-ras protein InNIH 3T3 cells transformed with activated H-ras
In DepthDetails ArticlePubMed