BDBM50080060 2-[(Z)-2-Butoxy-2-(4-chloro-phenyl)-vinyl]-2H-tetrazole::CHEMBL66701
SMILES CCCCO\C(=C/n1ncnn1)c1ccc(Cl)cc1
InChI Key InChIKey=KUVSMUPNINYCGZ-LCYFTJDESA-N
Data  1 IC50
  Tab Delimited (TSV)   2D SDfile   Computed 3D by Vconf -m prep SDfile
Find this compound or compounds like it in BindingDB:
Activity Spreadsheet -- Enzyme Inhibition Constant Data from BindingDB
Found 1 hit for monomerid = 50080060
TargetMetabotropic glutamate receptor 2(Homo sapiens (Human))
F. Hoffmann-La Roche
Curated by ChEMBL
LigandPNGBDBM50080060(2-[(Z)-2-Butoxy-2-(4-chloro-phenyl)-vinyl]-2H-tetr...)
Affinity DataIC50:  3.16E+3nM. Assay description: Inhibition of 10 uM 1S, 3R-ACPD stimulated GTP gamma 35S binding to rat mGluR2 expressed in CHO cells
In DepthDetails ArticlePubMed