BDBM50080271 CHEMBL312817::Naphthalen-1-yl-phosphonic acid
SMILES OP(O)(=O)c1cccc2ccccc12
InChI Key InChIKey=YOOYVODKUBZAPO-UHFFFAOYSA-N
Data  1 Kd
  Tab Delimited (TSV)   2D SDfile   Computed 3D by Vconf -m prep SDfile
Find this compound or compounds like it in BindingDB:
Activity Spreadsheet -- Enzyme Inhibition Constant Data from BindingDB
Found 1 hit for monomerid = 50080271
TargetTyrosine-protein kinase Lck(Homo sapiens (Human))
Abbott Laboratories
Curated by ChEMBL
LigandPNGBDBM50080271(CHEMBL312817 | Naphthalen-1-yl-phosphonic acid)
Affinity DataKd:  1.50E+6nM. Assay description: Binding affinity against Lck SH2 domain
In DepthDetails ArticlePubMed