BDBM50080275 CHEMBL77562::benzene-1,3,5-tricarboxylic acid
SMILES OC(=O)c1cc(cc(c1)C(O)=O)C(O)=O
InChI Key InChIKey=QMKYBPDZANOJGF-UHFFFAOYSA-N
Data  1 Kd
PDB links: 3 PDB IDs match this monomer.
  Tab Delimited (TSV)   2D SDfile   Computed 3D by Vconf -m prep SDfile
Find this compound or compounds like it in BindingDB:
Activity Spreadsheet -- Enzyme Inhibition Constant Data from BindingDB
Found 1 hit for monomerid = 50080275
TargetTyrosine-protein kinase Lck(Homo sapiens (Human))
Abbott Laboratories
Curated by ChEMBL
LigandPNGBDBM50080275(CHEMBL77562 | benzene-1,3,5-tricarboxylic acid)
Affinity DataKd:  2.00E+5nM. Assay description: Binding affinity against Lck SH2 domain
In DepthDetails ArticlePubMed