BDBM50080283 6-(1-Hydroxy-butyl)-5,8-dimethoxy-[1,4]naphthoquinone::CHEMBL421321
SMILES CCCC(O)c1cc(OC)c2C(=O)C=CC(=O)c2c1OC
InChI Key InChIKey=OECCNDBOWNOGEF-UHFFFAOYSA-N
Data  1 IC50
  Tab Delimited (TSV)   2D SDfile   Computed 3D by Vconf -m prep SDfile
Find this compound or compounds like it in BindingDB:
Activity Spreadsheet -- Enzyme Inhibition Constant Data from BindingDB
Found 1 hit for monomerid = 50080283
TargetDNA topoisomerase 1(Homo sapiens (Human))
Chungnam National University
Curated by ChEMBL
LigandPNGBDBM50080283(6-(1-Hydroxy-butyl)-5,8-dimethoxy-[1,4]naphthoquin...)
Affinity DataIC50:  1.30E+5nM. Assay description: Compound was evaluated for the inhibition of DNA topoisomerase-I of calf thymus
In DepthDetails ArticlePubMed