BDBM50080366 (S)-1-(2-Di-o-tolylmethyleneaminooxy-ethyl)-piperidine-3-carboxylic acid; hydrochloride::CHEMBL543169
SMILES [#6]-c1ccccc1\[#6](=[#7]/[#8]-[#6]-[#6]-[#7]-1-[#6]-[#6]-[#6]-[#6@@H](-[#6]-1)-[#6](-[#8])=O)-c1ccccc1-[#6]
InChI Key InChIKey=IURAZZBOFLIKCL-IBGZPJMESA-N
Data  1 KI
  Tab Delimited (TSV)   2D SDfile   Computed 3D by Vconf -m prep SDfile
Find this compound or compounds like it in BindingDB:
Activity Spreadsheet -- Enzyme Inhibition Constant Data from BindingDB
Found 1 hit for monomerid = 50080366
TargetSodium- and chloride-dependent GABA transporter 1(Rattus norvegicus)
Novo Nordisk
Curated by ChEMBL
LigandPNGBDBM50080366((S)-1-(2-Di-o-tolylmethyleneaminooxy-ethyl)-piperi...)
Affinity DataKi:  126nM. Assay description: In vitro inhibition of [3H]GABA uptake at the Sodium- and chloride-dependent GABA transporter 1 (GAT-1) uptake site in rat brain synaptosomes
In DepthDetails ArticlePubMed