BDBM50080373 (R)-1-{2-[1-(2-Fluoro-phenyl)-1-o-tolyl-meth-(Z)-ylideneaminooxy]-ethyl}-piperidine-3-carboxylic acid; hydrochloride::CHEMBL543168
SMILES Cc1ccccc1\C(=N\OCCN1CCC[C@H](C1)C(O)=O)c1ccccc1F
InChI Key InChIKey=LTZZCGCLARWZKA-PJXFJRINSA-N
Data  1 KI
  Tab Delimited (TSV)   2D SDfile   Computed 3D by Vconf -m prep SDfile
Find this compound or compounds like it in BindingDB:
Activity Spreadsheet -- Enzyme Inhibition Constant Data from BindingDB
Found 1 hit for monomerid = 50080373
TargetSodium- and chloride-dependent GABA transporter 1(Rattus norvegicus)
Novo Nordisk
Curated by ChEMBL
LigandPNGBDBM50080373((R)-1-{2-[1-(2-Fluoro-phenyl)-1-o-tolyl-meth-(Z)-y...)
Affinity DataKi:  41nM. Assay description: In vitro inhibition of [3H]GABA uptake at the Sodium- and chloride-dependent GABA transporter 1 (GAT-1) uptake site in rat brain synaptosomes
In DepthDetails ArticlePubMed