BDBM50080588 (2R,3R,4S)-4-Benzo[1,3]dioxol-5-yl-1-[(2,6-diethyl-phenylcarbamoyl)-methyl]-2-(4-ethoxy-phenyl)-pyrrolidine-3-carboxylic acid::CHEMBL435385
SMILES CCOc1ccc(cc1)[C@H]1[C@@H]([C@H](CN1CC(=O)Nc1c(CC)cccc1CC)c1ccc2OCOc2c1)C(O)=O
InChI Key InChIKey=RNNCMVHNZGHSLY-ICTSCBFQSA-N
Data  4 IC50
  Tab Delimited (TSV)   2D SDfile   Computed 3D by Vconf -m prep SDfile
Find this compound or compounds like it in BindingDB:
Activity Spreadsheet -- Enzyme Inhibition Constant Data from BindingDB
Found 4 hits for monomerid = 50080588
TargetEndothelin-1 receptor(Homo sapiens (Human))
Abbott Laboratories
Curated by ChEMBL
LigandPNGBDBM50080588((2R,3R,4S)-4-Benzo[1,3]dioxol-5-yl-1-[(2,6-diethyl...)
Affinity DataIC50:  340nM. Assay description: Binding affinity towards human Endothelin A receptor (hET -A)
In DepthDetails ArticlePubMed
TargetEndothelin receptor type B(Homo sapiens (Human))
Abbott Laboratories
Curated by ChEMBL
LigandPNGBDBM50080588((2R,3R,4S)-4-Benzo[1,3]dioxol-5-yl-1-[(2,6-diethyl...)
Affinity DataIC50:  1.20nM. Assay description: Binding affinity towards human Endothelin B receptor (hET -B)
In DepthDetails ArticlePubMed
TargetEndothelin receptor type B(Homo sapiens (Human))
Abbott Laboratories
Curated by ChEMBL
LigandPNGBDBM50080588((2R,3R,4S)-4-Benzo[1,3]dioxol-5-yl-1-[(2,6-diethyl...)
Affinity DataIC50:  1.20nM. Assay description: Binding affinity towards human Endothelin B receptor (hET -B)
In DepthDetails ArticlePubMed
TargetEndothelin-1 receptor(Homo sapiens (Human))
Abbott Laboratories
Curated by ChEMBL
LigandPNGBDBM50080588((2R,3R,4S)-4-Benzo[1,3]dioxol-5-yl-1-[(2,6-diethyl...)
Affinity DataIC50:  340nM. Assay description: Binding affinity towards human Endothelin A receptor (hET -A)
In DepthDetails ArticlePubMed