BDBM50080693 CHEMBL3422454
SMILES OC(=O)c1cc(Cc2ccc(O)cc2)n(n1)-c1ccc(Cl)c(Cl)c1
InChI Key InChIKey=JYDFQYKUUSMRDX-UHFFFAOYSA-N
Data  1 Kd
  Tab Delimited (TSV)   2D SDfile   Computed 3D by Vconf -m prep SDfile
Find this compound or compounds like it in BindingDB:
Activity Spreadsheet -- Enzyme Inhibition Constant Data from BindingDB
Found 1 hit for monomerid = 50080693
TargetReplication protein A 70 kDa DNA-binding subunit(Homo sapiens (Human))
Vanderbilt University School Of Medicine
Curated by ChEMBL
LigandPNGBDBM50080693(CHEMBL3422454)
Affinity DataKd: >500nM. Assay description: Binding affinity to RPA70N protein (unknown origin) incubated for 1 hr using FITC-ATRIP/FITC-ATRIP2 peptide probe by fluorescence polarization anisot...
In DepthDetails ArticlePubMed