BDBM50081083 6-{4-[2-(4-Isobutyl-piperazin-1-yl)-ethyl]-phenyl}-pyridin-2-ylamine::CHEMBL86810
SMILES CC(C)CN1CCN(CCc2ccc(cc2)-c2cccc(N)n2)CC1
InChI Key InChIKey=SKHVMUAVXNDFIZ-UHFFFAOYSA-N
Data  3 IC50
  Tab Delimited (TSV)   2D SDfile   Computed 3D by Vconf -m prep SDfile
Find this compound or compounds like it in BindingDB:
Activity Spreadsheet -- Enzyme Inhibition Constant Data from BindingDB
Found 3 hits for monomerid = 50081083
TargetNitric oxide synthase, brain(Rattus norvegicus (rat))
Pfizer
Curated by ChEMBL
LigandPNGBDBM50081083(6-{4-[2-(4-Isobutyl-piperazin-1-yl)-ethyl]-phenyl}...)
Affinity DataIC50:  193nM. Assay description: Inhibitory activity against rat neuronal nitric oxide synthase (nNOS)
In DepthDetails ArticlePubMed
TargetNitric oxide synthase, brain(Homo sapiens (Human))
Pfizer
Curated by ChEMBL
LigandPNGBDBM50081083(6-{4-[2-(4-Isobutyl-piperazin-1-yl)-ethyl]-phenyl}...)
Affinity DataIC50:  350nM. Assay description: Inhibitory activity against human neuronal nitric oxide synthase (nNOS)
In DepthDetails ArticlePubMed
TargetNitric oxide synthase, endothelial(Homo sapiens (Human))
Pfizer
Curated by ChEMBL
LigandPNGBDBM50081083(6-{4-[2-(4-Isobutyl-piperazin-1-yl)-ethyl]-phenyl}...)
Affinity DataIC50:  372nM. Assay description: Inhibitory activity against human endothelial nitric oxide synthase (eNOS)
In DepthDetails ArticlePubMed