BDBM50081097 CHEMBL3421883
SMILES [H][C@]12CCc3cc(O)ccc3[C@]1(CC)C[C@@](C)(O)[C@](O)(CC=C)C2
InChI Key InChIKey=LICOXDHXTVWUKR-XLNTUCKNSA-N
Data  2 IC50
  Tab Delimited (TSV)   2D SDfile   Computed 3D by Vconf -m prep SDfile
Find this compound or compounds like it in BindingDB:
Activity Spreadsheet -- Enzyme Inhibition Constant Data from BindingDB
Found 2 hits for monomerid = 50081097
TargetGlucocorticoid receptor(Homo sapiens (Human))
TBA
Curated by ChEMBL
LigandPNGBDBM50081097(CHEMBL3421883)
Affinity DataIC50: >5.00E+3nM. Assay description: Transrepression activity at glucocorticoid receptor in human SW1353 cells assessed as repression of IL-1-induced MMP-13 production after 24 hrs by EL...
In DepthDetails ArticlePubMed
TargetGlucocorticoid receptor(Homo sapiens (Human))
TBA
Curated by ChEMBL
LigandPNGBDBM50081097(CHEMBL3421883)
Affinity DataIC50:  35nM. Assay description: Binding affinity to human GR
In DepthDetails ArticlePubMed