BDBM50081265 (S)-2-{4-[(2,7-Dimethyl-4-oxo-3,4-dihydro-quinazolin-6-ylmethyl)-prop-2-ynyl-amino]-2-fluoro-benzoylamino}-5-(5-oxo-4,5-dihydro-1H-[1,2,4]triazole-3-sulfinyl)-pentanoic acid::CHEMBL105346
SMILES Cc1nc2cc(C)c(CN(CC#C)c3ccc(C(=O)N[C@@H](CCCS(=O)c4n[nH]c(=O)[nH]4)C(O)=O)c(F)c3)cc2c(=O)[nH]1
InChI Key InChIKey=QHFCCIPBELKNJQ-QZGYYEBRSA-N
Data  1 IC50
  Tab Delimited (TSV)   2D SDfile   Computed 3D by Vconf -m prep SDfile
Find this compound or compounds like it in BindingDB:
Activity Spreadsheet -- Enzyme Inhibition Constant Data from BindingDB
Found 1 hit for monomerid = 50081265
TargetThymidylate synthase(Mus musculus)
Astrazeneca
Curated by ChEMBL
LigandPNGBDBM50081265((S)-2-{4-[(2,7-Dimethyl-4-oxo-3,4-dihydro-quinazol...)
Affinity DataIC50:  0.860nM. Assay description: Inhibition of isolated thymidylate synthase partially purified from L1210 mouse leukemia cells
In DepthDetails ArticlePubMed