BDBM50081454 CHEMBL91377::sulfonylurea analogue
SMILES O=C(NCCc1cccs1)NS(=O)(=O)c1ccccc1-c1ccc(CN2c3ccccc3Oc3ccccc3C2=O)cc1
InChI Key InChIKey=URLWRDGMBOQFRA-UHFFFAOYSA-N
Data  1 KI
  Tab Delimited (TSV)   2D SDfile   Computed 3D by Vconf -m prep SDfile
Find this compound or compounds like it in BindingDB:
Activity Spreadsheet -- Enzyme Inhibition Constant Data from BindingDB
Found 1 hit for monomerid = 50081454
TargetProstaglandin E2 receptor EP1 subtype(Homo sapiens (Human))
Merck Frosst Centre For Therapeutic Research
Curated by ChEMBL
LigandPNGBDBM50081454(CHEMBL91377 | sulfonylurea analogue)
Affinity DataKi:  1.08E+4nM. Assay description: Affinity at human EP1 receptor.
In DepthDetails ArticlePubMed