BDBM50081481 3-Chloro-6-((R)-1-methyl-pyrrolidin-2-ylmethoxy)-pyridazine::CHEMBL329768
SMILES CN1CCC[C@@H]1COc1ccc(Cl)nn1
InChI Key InChIKey=BYLJJKHKXXAFHV-MRVPVSSYSA-N
Data  1 KI
  Tab Delimited (TSV)   2D SDfile   Computed 3D by Vconf -m prep SDfile
Find this compound or compounds like it in BindingDB:
Activity Spreadsheet -- Enzyme Inhibition Constant Data from BindingDB
Found 1 hit for monomerid = 50081481
TargetNeuronal acetylcholine receptor subunit alpha-4/beta-2(Rattus norvegicus (Rat))
Abbott Laboratories
Curated by ChEMBL
LigandPNGBDBM50081481(3-Chloro-6-((R)-1-methyl-pyrrolidin-2-ylmethoxy)-p...)
Affinity DataKi:  85nM. Assay description: Nicotinic acetylcholine receptor binding activity was determined by ability of the compound to displace [3H]- (-) cytisine binding from whole rat bra...
In DepthDetails ArticlePubMed