BDBM50081487 5-((S)-1-Methyl-azetidin-2-ylmethoxy)-pyrimidine::CHEMBL93485
SMILES CN1CC[C@H]1COc1cncnc1
InChI Key InChIKey=WDBVHKDVTRQPLN-QMMMGPOBSA-N
Data  2 KI
  Tab Delimited (TSV)   2D SDfile   Computed 3D by Vconf -m prep SDfile
Find this compound or compounds like it in BindingDB:
Activity Spreadsheet -- Enzyme Inhibition Constant Data from BindingDB
Found 2 hits for monomerid = 50081487
TargetNeuronal acetylcholine receptor subunit alpha-4/beta-2(Rattus norvegicus (Rat))
Abbott Laboratories
Curated by ChEMBL
LigandPNGBDBM50081487(5-((S)-1-Methyl-azetidin-2-ylmethoxy)-pyrimidine |...)
Affinity DataKi:  6.5nM. Assay description: Nicotinic acetylcholine receptor binding activity was determined by ability of the compound to displace [3H]- (-) cytisine binding from whole rat bra...
In DepthDetails ArticlePubMed
TargetNeuronal acetylcholine receptor subunit alpha-10(Rattus norvegicus)
Abbott Laboratories
Curated by ChEMBL
LigandPNGBDBM50081487(5-((S)-1-Methyl-azetidin-2-ylmethoxy)-pyrimidine |...)
Affinity DataKi: >1.00E+4nM. Assay description: Nicotinic acetylcholine receptor binding activity was determined by ability of the compound to displace [125I]-alpha-BgT binding to rat brain membran...
In DepthDetails ArticlePubMed