BDBM50081493 2-(1-Methyl-pyrrolidin-3-yloxy)-pyridine::CHEMBL89943
SMILES CN1CCC(C1)Oc1ccccn1
InChI Key InChIKey=DYDHHAHLVCSNJZ-UHFFFAOYSA-N
Data  1 KI
  Tab Delimited (TSV)   2D SDfile   Computed 3D by Vconf -m prep SDfile
Find this compound or compounds like it in BindingDB:
Activity Spreadsheet -- Enzyme Inhibition Constant Data from BindingDB
Found 1 hit for monomerid = 50081493
TargetNeuronal acetylcholine receptor subunit alpha-4/beta-2(Rattus norvegicus (Rat))
Abbott Laboratories
Curated by ChEMBL
LigandPNGBDBM50081493(2-(1-Methyl-pyrrolidin-3-yloxy)-pyridine | CHEMBL8...)
Affinity DataKi: >1.00E+4nM. Assay description: Nicotinic acetylcholine receptor binding activity was determined by ability of the compound to displace [3H]- (-) cytisine binding from whole rat bra...
In DepthDetails ArticlePubMed