BDBM50081552 CHEMBL3422063
SMILES CC[C@@H](NC(=O)c1ccc2[nH]nc(-c3ccc(OC4CCN(C)CC4)cc3)c2c1)c1ccccc1Cl
InChI Key
Data  1 IC50
PDB links: 1 PDB ID matches this monomer.
  Tab Delimited (TSV)   2D SDfile   Computed 3D by Vconf -m prep SDfile
Find this compound or compounds like it in BindingDB:
Activity Spreadsheet -- Enzyme Inhibition Constant Data from BindingDB
Found 1 hit for monomerid = 50081552
TargetDual specificity protein kinase TTK(Homo sapiens (Human))
Entremed
Curated by ChEMBL
LigandPNGBDBM50081552(CHEMBL3422063)
Affinity DataIC50:  1.90nM. Assay description: Inhibition of amino terminal GST-fused full length human TTK using His6-SUMO-TTK-N as substrate preincubated for 15 mins prior to ATP addition by ind...