BDBM50081582 7-Phenyl-5,6,7,8-tetrahydro-pteridine-2,4-diamine::CHEMBL328830
SMILES Nc1nc(N)c2NCC(Nc2n1)c1ccccc1
InChI Key InChIKey=IZJDAHCBVJUGIG-UHFFFAOYSA-N
Data  2 IC50
  Tab Delimited (TSV)   2D SDfile   Computed 3D by Vconf -m prep SDfile
Find this compound or compounds like it in BindingDB:
Activity Spreadsheet -- Enzyme Inhibition Constant Data from BindingDB
Found 2 hits for monomerid = 50081582
TargetNitric oxide synthase, brain(Homo sapiens (Human))
Aventis Pharma
Curated by ChEMBL
LigandPNGBDBM50081582(7-Phenyl-5,6,7,8-tetrahydro-pteridine-2,4-diamine ...)
Affinity DataIC50:  2.40E+4nM. Assay description: Inhibitory activity against human neuronal nitric oxide synthase (NOS-I)
In DepthDetails ArticlePubMed
TargetNitric oxide synthase, endothelial(Sus scrofa)
Julius-Maximilians University WüRzburg
Curated by ChEMBL
LigandPNGBDBM50081582(7-Phenyl-5,6,7,8-tetrahydro-pteridine-2,4-diamine ...)
Affinity DataIC50:  2.40E+4nM. Assay description: Inhibitory activity against Nitric oxide synthase (derived from porcine brain cerebellum)
In DepthDetails ArticlePubMed