BDBM50081745 4-Benzyl-1-[4-(1H-pyrrol-3-yl)-but-3-ynyl]-piperidine::CHEMBL94987
SMILES C(CN1CCC(Cc2ccccc2)CC1)C#Cc1cc[nH]c1
InChI Key InChIKey=GXBHAMNCULDZSF-UHFFFAOYSA-N
Data  3 IC50
  Tab Delimited (TSV)   2D SDfile   Computed 3D by Vconf -m prep SDfile
Find this compound or compounds like it in BindingDB:
Activity Spreadsheet -- Enzyme Inhibition Constant Data from BindingDB
Found 3 hits for monomerid = 50081745
TargetGlutamate receptor ionotropic, NMDA 2C(Rattus norvegicus (Rat))
Warner-Lambert
Curated by ChEMBL
LigandPNGBDBM50081745(4-Benzyl-1-[4-(1H-pyrrol-3-yl)-but-3-ynyl]-piperid...)
Affinity DataIC50: >1.00E+5nM. Assay description: Compound was tested in vitro for inhibition of NMDA response at cloned NR1A/2C receptor expressed in Xenopus oocytes
In DepthDetails ArticlePubMed
TargetGlutamate receptor ionotropic, NMDA 1/2B(Rattus norvegicus (Rat))
Warner-Lambert
Curated by ChEMBL
LigandPNGBDBM50081745(4-Benzyl-1-[4-(1H-pyrrol-3-yl)-but-3-ynyl]-piperid...)
Affinity DataIC50:  190nM. Assay description: Inhibition of NMDA response at NR1A/2B receptor expressed in Xenopus oocytes
In DepthDetails ArticlePubMed
TargetGlutamate receptor ionotropic, NMDA 3A(Rattus norvegicus (Rat))
Warner-Lambert
Curated by ChEMBL
LigandPNGBDBM50081745(4-Benzyl-1-[4-(1H-pyrrol-3-yl)-but-3-ynyl]-piperid...)
Affinity DataIC50:  5.10E+4nM. Assay description: Compound was tested in vitro for inhibition of NMDA response at cloned NR1A/2A receptor expressed in Xenopus oocytes
In DepthDetails ArticlePubMed