BDBM50082034 CHEMBL3422393
SMILES Oc1cccc2C(=O)c3c(-c12)n(CCCN1CCOCC1)c(=O)c1cc(ccc31)[N+]([O-])=O
InChI Key InChIKey=LHNORVABLKPECN-UHFFFAOYSA-N
Data  1 IC50
  Tab Delimited (TSV)   2D SDfile   Computed 3D by Vconf -m prep SDfile
Find this compound or compounds like it in BindingDB:
Activity Spreadsheet -- Enzyme Inhibition Constant Data from BindingDB
Found 1 hit for monomerid = 50082034
TargetTyrosyl-DNA phosphodiesterase 1(Homo sapiens (Human))
Purdue University
Curated by ChEMBL
LigandPNGBDBM50082034(CHEMBL3422393)
Affinity DataIC50: >1.11E+5nM. Assay description: Inhibition of human recombinant TDP1 assessed as hydrolysis of N14Y to N14P after 15 mins by PAGE analysis
In DepthDetails ArticlePubMed