BDBM50082036 CHEMBL3422395
SMILES Cl.NCCCn1c2-c3c(cccc3O)C(=O)c2c2ccc(cc2c1=O)[N+]([O-])=O
InChI Key InChIKey=IRERNWMJWFAOOX-UHFFFAOYSA-N
Data  1 IC50
  Tab Delimited (TSV)   2D SDfile   Computed 3D by Vconf -m prep SDfile
Find this compound or compounds like it in BindingDB:
Activity Spreadsheet -- Enzyme Inhibition Constant Data from BindingDB
Found 1 hit for monomerid = 50082036
TargetTyrosyl-DNA phosphodiesterase 1(Homo sapiens (Human))
Purdue University
Curated by ChEMBL
LigandPNGBDBM50082036(CHEMBL3422395)
Affinity DataIC50:  1.20E+4nM. Assay description: Inhibition of human recombinant TDP1 assessed as hydrolysis of N14Y to N14P after 15 mins by PAGE analysis
In DepthDetails ArticlePubMed