BDBM50082106 CHEMBL3422591
SMILES C1CN(CCO1)c1ccc(cc1)-c1ccccc1
InChI Key InChIKey=OOQKNFIEEJFVKS-UHFFFAOYSA-N
Data  1 KI
  Tab Delimited (TSV)   2D SDfile   Computed 3D by Vconf -m prep SDfile
Find this compound or compounds like it in BindingDB:
Activity Spreadsheet -- Enzyme Inhibition Constant Data from BindingDB
Found 1 hit for monomerid = 50082106
TargetNeuronal acetylcholine receptor subunit alpha-7(Rattus norvegicus (Rat))
The University Of Sydney
Curated by ChEMBL
LigandPNGBDBM50082106(CHEMBL3422591)
Affinity DataKi: >1.00E+4nM. Assay description: Displacement of [3H]epibatidine from rat alpha7 nAChR transfected in HEK293 cells by liquid scintillation counting
In DepthDetails ArticlePubMed