BDBM50082399 (4R,5S,6S,7R)-1-(3-Amino-benzyl)-4,7-dibenzyl-3-[3-(4-fluoro-phenyl)-1H-indazol-5-ylmethyl]-5,6-dihydroxy-[1,3]diazepan-2-one::CHEMBL322991
SMILES Nc1cccc(CN2[C@H](Cc3ccccc3)[C@H](O)[C@@H](O)[C@@H](Cc3ccccc3)N(Cc3ccc4[nH]nc(-c5ccc(F)cc5)c4c3)C2=O)c1
InChI Key InChIKey=INZGMOIEIWGIQN-DDLQZHSQSA-N
Data  1 KI
  Tab Delimited (TSV)   2D SDfile   Computed 3D by Vconf -m prep SDfile
Find this compound or compounds like it in BindingDB:
Activity Spreadsheet -- Enzyme Inhibition Constant Data from BindingDB
Found 1 hit for monomerid = 50082399
TargetGag-Pol polyprotein [489-587](Human immunodeficiency virus type 1)
Dupont Pharmaceuticals
Curated by ChEMBL
LigandPNGBDBM50082399((4R,5S,6S,7R)-1-(3-Amino-benzyl)-4,7-dibenzyl-3-[3...)
Affinity DataKi:  0.300nM. Assay description: Binding affinity for HIV -1 Protease
In DepthDetails ArticlePubMed