BDBM50082419 1-(2-(furan-2-yl)-8-(3-phenylpropyl)-8H-pyrazolo[4,3-e][1,2,4]triazolo[1,5-c]pyrimidin-5-yl)-3-(4-methoxyphenyl)urea::1-[2-Furan-2-yl-8-(3-phenyl-propyl)-8H-pyrazolo[4,3-e][1,2,4]triazolo[1,5-c]pyrimidin-5-yl]-3-(4-methoxy-phenyl)-urea::CHEMBL139182
SMILES COc1ccc(NC(=O)Nc2nc3nn(CCCc4ccccc4)cc3c3nc(nn23)-c2ccco2)cc1
InChI Key InChIKey=OLJJUIWQSVLKJD-UHFFFAOYSA-N
Data  13 KI  1 IC50
  Tab Delimited (TSV)   2D SDfile   Computed 3D by Vconf -m prep SDfile
Find this compound or compounds like it in BindingDB:
Activity Spreadsheet -- Enzyme Inhibition Constant Data from BindingDB
Found 14 hits for monomerid = 50082419
TargetAdenosine receptor A3(Homo sapiens (Human))
Universit£
Curated by ChEMBL
LigandPNGBDBM50082419(1-(2-(furan-2-yl)-8-(3-phenylpropyl)-8H-pyrazolo[4...)
Affinity DataKi:  19.8nM. Assay description: Displacement of [3H]NECA from human adenosine A3 receptor expressed in CHO cellsChecked by Author
In DepthDetails ArticlePubMed
TargetAdenosine receptor A3(Homo sapiens (Human))
Universit£
Curated by ChEMBL
LigandPNGBDBM50082419(1-(2-(furan-2-yl)-8-(3-phenylpropyl)-8H-pyrazolo[4...)
Affinity DataKi:  20nM. Assay description: Displacement of [125]AB-MECA from human Adenosine A3 receptor expressed in HEK-293 cells
In DepthDetails ArticlePubMed
TargetAdenosine receptor A3(Homo sapiens (Human))
Universit£
Curated by ChEMBL
LigandPNGBDBM50082419(1-(2-(furan-2-yl)-8-(3-phenylpropyl)-8H-pyrazolo[4...)
Affinity DataKi:  40nM. Assay description: Binding affinity for human adenosine A3 receptor
In DepthDetails ArticlePubMed
TargetAdenosine receptor A3(Homo sapiens (Human))
Universit£
Curated by ChEMBL
LigandPNGBDBM50082419(1-(2-(furan-2-yl)-8-(3-phenylpropyl)-8H-pyrazolo[4...)
Affinity DataKi:  40nM. Assay description: Displacement of [3H]-MRE3008-F20 from human adenosine A3 receptor expressed in CHO cells; range 33-48
In DepthDetails ArticlePubMed
TargetAdenosine receptor A2a(Homo sapiens (Human))
Università
Curated by ChEMBL
LigandPNGBDBM50082419(1-(2-(furan-2-yl)-8-(3-phenylpropyl)-8H-pyrazolo[4...)
Affinity DataKi:  101nM. Assay description: Displacement of [3H]-SCH- 58261 from human adenosine A2A receptor expressed in CHO cells; range 880-1160
In DepthDetails ArticlePubMed
TargetAdenosine receptor A1(Homo sapiens (Human))
Università
Curated by ChEMBL
LigandPNGBDBM50082419(1-(2-(furan-2-yl)-8-(3-phenylpropyl)-8H-pyrazolo[4...)
Affinity DataKi:  251nM. Assay description: Displacement of [3H]-DPCPX from human Adenosine A1 receptor expressed in CHO cells
In DepthDetails ArticlePubMed
TargetAdenosine receptor A1(Homo sapiens (Human))
Università
Curated by ChEMBL
LigandPNGBDBM50082419(1-(2-(furan-2-yl)-8-(3-phenylpropyl)-8H-pyrazolo[4...)
Affinity DataKi:  251nM. Assay description: Displacement of [3H]-DPCPX from human adenosine A1 receptor expressed in CHO cells; range 221-286
In DepthDetails ArticlePubMed
TargetAdenosine receptor A2b(Homo sapiens (Human))
Università
Curated by ChEMBL
LigandPNGBDBM50082419(1-(2-(furan-2-yl)-8-(3-phenylpropyl)-8H-pyrazolo[4...)
Affinity DataKi:  802nM. Assay description: Displacement of [3H]-DPCPX from Adenosine A2b receptor expressed in CHO cells; range 719-895
In DepthDetails ArticlePubMed
TargetAdenosine receptor A2a(Homo sapiens (Human))
Università
Curated by ChEMBL
LigandPNGBDBM50082419(1-(2-(furan-2-yl)-8-(3-phenylpropyl)-8H-pyrazolo[4...)
Affinity DataKi:  1.01E+3nM. Assay description: Displacement of [3H]NECA from human adenosine A2A receptor expressed in CHO cellsChecked by Author
In DepthDetails ArticlePubMed
TargetAdenosine receptor A2a(Homo sapiens (Human))
Università
Curated by ChEMBL
LigandPNGBDBM50082419(1-(2-(furan-2-yl)-8-(3-phenylpropyl)-8H-pyrazolo[4...)
Affinity DataKi:  1.02E+3nM. Assay description: Displacement of specific [3H]-SCH- 58261 binding at human Adenosine A2A receptor expressed in HEK-293 cells
In DepthDetails ArticlePubMed
TargetAdenosine receptor A1(Rattus norvegicus (rat))
Università
Curated by ChEMBL
LigandPNGBDBM50082419(1-(2-(furan-2-yl)-8-(3-phenylpropyl)-8H-pyrazolo[4...)
Affinity DataKi:  1.51E+3nM. Assay description: Displacement of [3H]-DPCPX from Adenosine A1 receptor of rat brain membranes
In DepthDetails ArticlePubMed
TargetAdenosine receptor A2a(Rattus norvegicus (rat))
Università
Curated by ChEMBL
LigandPNGBDBM50082419(1-(2-(furan-2-yl)-8-(3-phenylpropyl)-8H-pyrazolo[4...)
Affinity DataKi: >1.00E+4nM. Assay description: Displacement of [3H]-SCH- 58261 from Adenosine A2A receptor in rat striatal membranes
In DepthDetails ArticlePubMed
TargetAdenosine receptor A3(Homo sapiens (Human))
Universit£
Curated by ChEMBL
LigandPNGBDBM50082419(1-(2-(furan-2-yl)-8-(3-phenylpropyl)-8H-pyrazolo[4...)
Affinity DataKi:  3.98E+4nM. Assay description: Displacement of [3H]MRE3008-F20 from human adenosine A3 receptor expressed in CHO cells after 120 mins
In DepthDetails ArticlePubMed
TargetAdenosine receptor A3(Homo sapiens (Human))
Universit£
Curated by ChEMBL
LigandPNGBDBM50082419(1-(2-(furan-2-yl)-8-(3-phenylpropyl)-8H-pyrazolo[4...)
Affinity DataIC50:  20nM. Assay description: Inhibitory concentration as antagonistic activity against cAMP generation inhibited by IB-MECA in CHO cell membranes transfected with human A3 recept...
In DepthDetails ArticlePubMed