BDBM50082431 CHEMBL3422972
SMILES COc1cc2nccc(CCC34CCC(CC3)(CO4)NCc3ccc4OCC(=O)Nc4n3)c2nc1C(O)=O
InChI Key InChIKey=YUGWXMFOVWSSAF-UHFFFAOYSA-N
Data  1 IC50
  Tab Delimited (TSV)   2D SDfile   Computed 3D by Vconf -m prep SDfile
Find this compound or compounds like it in BindingDB:
Activity Spreadsheet -- Enzyme Inhibition Constant Data from BindingDB
Found 1 hit for monomerid = 50082431
TargetPotassium voltage-gated channel subfamily H member 2(Homo sapiens (Human))
Merck Research Laboratories
Curated by ChEMBL
LigandPNGBDBM50082431(CHEMBL3422972)
Affinity DataIC50:  13nM. Assay description: Inhibition of MK499 binding to human ERG
In DepthDetails ArticlePubMed