BDBM50083008 CHEMBL3422802
SMILES NC(=O)c1ccccc1N1CC=C(NC1=O)c1cccc(c1)[N+]([O-])=O
InChI Key InChIKey=JIOCCGAXFKHUJF-UHFFFAOYSA-N
Data  1 IC50  1 EC50
  Tab Delimited (TSV)   2D SDfile   Computed 3D by Vconf -m prep SDfile
Find this compound or compounds like it in BindingDB:
Activity Spreadsheet -- Enzyme Inhibition Constant Data from BindingDB
Found 2 hits for monomerid = 50083008
TargetTransient receptor potential cation channel subfamily M member 8(Rattus norvegicus (Rat))
National Research Council
Curated by ChEMBL
LigandPNGBDBM50083008(CHEMBL3422802)
Affinity DataEC50:  1.54E+4nM. Assay description: Agonist activity at rat TRPM8 expressed in HEK293 cells assessed as induction of intracellular Ca2+ level by Fluo-4-AM dye based spectrofluorimetry
In DepthDetails ArticlePubMed
TargetTransient receptor potential cation channel subfamily M member 8(Rattus norvegicus (Rat))
National Research Council
Curated by ChEMBL
LigandPNGBDBM50083008(CHEMBL3422802)
Affinity DataIC50:  8.30E+3nM. Assay description: Antagonist activity against rat TRPM8 expressed in HEK293 cells assessed as inhibition of icilin-induced intracellular Ca2+ level pre-treated 5 mins ...
In DepthDetails ArticlePubMed