BDBM50083016 CHEMBL3422810
SMILES [O-][N+](=O)c1cccc(c1)C1=CCN(C(=O)N1)c1cccc(Br)c1
InChI Key InChIKey=OUUZIEDSZGRVAZ-UHFFFAOYSA-N
Data  1 IC50  1 EC50
  Tab Delimited (TSV)   2D SDfile   Computed 3D by Vconf -m prep SDfile
Find this compound or compounds like it in BindingDB:
Activity Spreadsheet -- Enzyme Inhibition Constant Data from BindingDB
Found 2 hits for monomerid = 50083016
TargetTransient receptor potential cation channel subfamily M member 8(Rattus norvegicus (Rat))
National Research Council
Curated by ChEMBL
LigandPNGBDBM50083016(CHEMBL3422810)
Affinity DataEC50:  600nM. Assay description: Agonist activity at rat TRPM8 expressed in HEK293 cells assessed as induction of intracellular Ca2+ level by Fluo-4-AM dye based spectrofluorimetry
In DepthDetails ArticlePubMed
TargetTransient receptor potential cation channel subfamily M member 8(Rattus norvegicus (Rat))
National Research Council
Curated by ChEMBL
LigandPNGBDBM50083016(CHEMBL3422810)
Affinity DataIC50:  1.50E+3nM. Assay description: Antagonist activity against rat TRPM8 expressed in HEK293 cells assessed as inhibition of icilin-induced intracellular Ca2+ level pre-treated 5 mins ...
In DepthDetails ArticlePubMed