BDBM50083273 CHEMBL545563::Hexahydro-2,5-methano-pentalene-3a-carboxylic acid 3-[4-(2-methoxy-phenyl)-piperazin-1-yl]-propyl ester; DIhydrochloride
SMILES COc1ccccc1N1CCN(CCCOC(=O)C23CC4C[C@@H]2C[C@@H](C3)C4)CC1
InChI Key InChIKey=RGPJWFVZQAQTCB-FKOHWTJXSA-N
Data  1 KI
  Tab Delimited (TSV)   2D SDfile   Computed 3D by Vconf -m prep SDfile
Find this compound or compounds like it in BindingDB:
Activity Spreadsheet -- Enzyme Inhibition Constant Data from BindingDB
Found 1 hit for monomerid = 50083273
Target5-hydroxytryptamine receptor 1A(Rattus norvegicus (rat))
Wyeth-Ayerst Research
Curated by ChEMBL
LigandPNGBDBM50083273(CHEMBL545563 | Hexahydro-2,5-methano-pentalene-3a-...)
Affinity DataKi:  26nM. Assay description: Antagonist activity against rat hippocampal tissue 5-hydroxytryptamine 1A receptor
In DepthDetails ArticlePubMed