BDBM50083283 Adamantane-1-carboxylic acid {3-[4-(2-methoxy-phenyl)-piperazin-1-yl]-propyl}-amide; hydrochloride::CHEMBL543692
SMILES COc1ccccc1N1CCN(CCCNC(=O)C23C[C@H]4C[C@H](C[C@H](C4)C2)C3)CC1
InChI Key InChIKey=AZLBYNLKNFZXFQ-OVZPOALRSA-N
Data  2 KI
  Tab Delimited (TSV)   2D SDfile   Computed 3D by Vconf -m prep SDfile
Find this compound or compounds like it in BindingDB:
Activity Spreadsheet -- Enzyme Inhibition Constant Data from BindingDB
Found 2 hits for monomerid = 50083283
Target5-hydroxytryptamine receptor 1A(Rattus norvegicus (rat))
Wyeth-Ayerst Research
Curated by ChEMBL
LigandPNGBDBM50083283(Adamantane-1-carboxylic acid {3-[4-(2-methoxy-phen...)
Affinity DataKi:  1nM. Assay description: Antagonist activity against rat hippocampal tissue 5-hydroxytryptamine 1A receptor
In DepthDetails ArticlePubMed
TargetD(2) dopamine receptor(Rattus norvegicus (rat))
Wyeth-Ayerst Research
Curated by ChEMBL
LigandPNGBDBM50083283(Adamantane-1-carboxylic acid {3-[4-(2-methoxy-phen...)
Affinity DataKi:  200nM. Assay description: Inhibitory activity against rat limbic tissue Dopamine receptor D2
In DepthDetails ArticlePubMed