BDBM50083285 1-Adamantan-1-yl-3-{2-[4-(3-chloro-phenyl)-piperazin-1-yl]-ethyl}-urea::CHEMBL149887
SMILES Clc1cccc(c1)N1CCN(CCNC(=O)NC23C[C@H]4C[C@H](C[C@H](C4)C2)C3)CC1
InChI Key InChIKey=YNPAKXJCEFCUJW-NWKQVAMWSA-N
Data  1 KI
  Tab Delimited (TSV)   2D SDfile   Computed 3D by Vconf -m prep SDfile
Find this compound or compounds like it in BindingDB:
Activity Spreadsheet -- Enzyme Inhibition Constant Data from BindingDB
Found 1 hit for monomerid = 50083285
Target5-hydroxytryptamine receptor 1A(Rattus norvegicus (rat))
Wyeth-Ayerst Research
Curated by ChEMBL
LigandPNGBDBM50083285(1-Adamantan-1-yl-3-{2-[4-(3-chloro-phenyl)-piperaz...)
Affinity DataKi:  61nM. Assay description: Antagonist activity against rat hippocampal tissue 5-hydroxytryptamine 1A receptor
In DepthDetails ArticlePubMed