BDBM50083305 Adamantane-1-carboxylic acid methyl-[2-(4-pyrimidin-2-yl-piperazin-1-yl)-ethyl]-amide; Dihydrochloride::CHEMBL539570
SMILES CN(CCN1CCN(CC1)c1ncccn1)C(=O)C12C[C@H]3C[C@H](C[C@H](C3)C1)C2
InChI Key InChIKey=UAEJICOLAFBSOQ-VTIBSLLJSA-N
Data  1 KI
  Tab Delimited (TSV)   2D SDfile   Computed 3D by Vconf -m prep SDfile
Find this compound or compounds like it in BindingDB:
Activity Spreadsheet -- Enzyme Inhibition Constant Data from BindingDB
Found 1 hit for monomerid = 50083305
Target5-hydroxytryptamine receptor 1A(Rattus norvegicus (rat))
Wyeth-Ayerst Research
Curated by ChEMBL
LigandPNGBDBM50083305(Adamantane-1-carboxylic acid methyl-[2-(4-pyrimidi...)
Affinity DataKi:  60nM. Assay description: Antagonist activity against rat hippocampal tissue 5-hydroxytryptamine 1A receptor
In DepthDetails ArticlePubMed