BDBM50083311 Adamantane-1-carboxylic acid [2-(4-benzyl-piperazin-1-yl)-1-methyl-ethyl]-amide; Dihydrochloride::CHEMBL543219
SMILES C[C@H](CN1CCN(Cc2ccccc2)CC1)NC(=O)C12C[C@H]3C[C@H](C[C@H](C3)C1)C2
InChI Key InChIKey=LVISOYJWZWSLLW-DEBZWXBRSA-N
Data  1 KI
  Tab Delimited (TSV)   2D SDfile   Computed 3D by Vconf -m prep SDfile
Find this compound or compounds like it in BindingDB:
Activity Spreadsheet -- Enzyme Inhibition Constant Data from BindingDB
Found 1 hit for monomerid = 50083311
Target5-hydroxytryptamine receptor 1A(Rattus norvegicus (rat))
Wyeth-Ayerst Research
Curated by ChEMBL
LigandPNGBDBM50083311(Adamantane-1-carboxylic acid [2-(4-benzyl-piperazi...)
Affinity DataKi:  37nM. Assay description: Antagonist activity against rat hippocampal tissue 5-hydroxytryptamine 1A receptor
In DepthDetails ArticlePubMed