BDBM50083340 6-[4-(3,4-Dimethyl-phenyl)-piperazin-1-ylmethyl]-4H-benzo[1,4]oxazin-3-one::CHEMBL150181
SMILES Cc1ccc(cc1C)N1CCN(Cc2ccc3OCC(=O)Nc3c2)CC1
InChI Key InChIKey=RCWYEZYTOVCNOJ-UHFFFAOYSA-N
Data  3 KI
  Tab Delimited (TSV)   2D SDfile   Computed 3D by Vconf -m prep SDfile
Find this compound or compounds like it in BindingDB:
Activity Spreadsheet -- Enzyme Inhibition Constant Data from BindingDB
Found 3 hits for monomerid = 50083340
TargetD(4) dopamine receptor(Homo sapiens (Human))
Warner-Lambert
Curated by ChEMBL
LigandPNGBDBM50083340(6-[4-(3,4-Dimethyl-phenyl)-piperazin-1-ylmethyl]-4...)
Affinity DataKi:  5.10nM. Assay description: Binding affinity at Dopamine receptor D4 in CHO cells by radioligand displacement.
In DepthDetails ArticlePubMed
TargetD(3) dopamine receptor(Homo sapiens (Human))
Warner-Lambert
Curated by ChEMBL
LigandPNGBDBM50083340(6-[4-(3,4-Dimethyl-phenyl)-piperazin-1-ylmethyl]-4...)
Affinity DataKi:  864nM. Assay description: Binding affinity at Dopamine receptor D3 in CHO cells by radioligand displacement.
In DepthDetails ArticlePubMed
TargetD(2) dopamine receptor(Homo sapiens (Human))
Warner-Lambert
Curated by ChEMBL
LigandPNGBDBM50083340(6-[4-(3,4-Dimethyl-phenyl)-piperazin-1-ylmethyl]-4...)
Affinity DataKi:  2.34E+3nM. Assay description: Binding affinity at Dopamine receptor D2 in CHO cells by radioligand displacement.
In DepthDetails ArticlePubMed