BDBM50083665 4-(Benzylamino-methyl)-1-[3-(5-[1,2,4]triazol-4-yl-1H-indol-3-yl)-propyl]-piperidin-4-ol::CHEMBL326125
SMILES OC1(CNCc2ccccc2)CCN(CCCc2c[nH]c3ccc(cc23)-n2cnnc2)CC1
InChI Key InChIKey=XYDQALICSDUWGB-UHFFFAOYSA-N
Data  2 IC50
  Tab Delimited (TSV)   2D SDfile   Computed 3D by Vconf -m prep SDfile
Find this compound or compounds like it in BindingDB:
Activity Spreadsheet -- Enzyme Inhibition Constant Data from BindingDB
Found 2 hits for monomerid = 50083665
Target5-hydroxytryptamine receptor 1B(Homo sapiens (Human))
Merck Sharp & Dohme Research Laboratories
Curated by ChEMBL
LigandPNGBDBM50083665(4-(Benzylamino-methyl)-1-[3-(5-[1,2,4]triazol-4-yl...)
Affinity DataIC50:  47nM. Assay description: Ability to displace [3H]-5-HT from recombinant human 5-hydroxytryptamine 1B receptor stably expressed in CHO cells determined in vitro
In DepthDetails ArticlePubMed
Target5-hydroxytryptamine receptor 1D(Homo sapiens (Human))
Merck Sharp & Dohme Research Laboratories
Curated by ChEMBL
LigandPNGBDBM50083665(4-(Benzylamino-methyl)-1-[3-(5-[1,2,4]triazol-4-yl...)
Affinity DataIC50:  0.450nM. Assay description: Ability to displace [3H]-5-HT from recombinant human 5-hydroxytryptamine 1D receptor stably expressed in CHO cells determined in vitro
In DepthDetails ArticlePubMed