BDBM50083673 CHEMBL3422943
SMILES CCOC(=O)c1cc(-c2cccc(OC(=O)NC3CCCCC3)c2)n(n1)-c1ccccc1
InChI Key InChIKey=YNVZNNYDSSGETQ-UHFFFAOYSA-N
Data  2 IC50
  Tab Delimited (TSV)   2D SDfile   Computed 3D by Vconf -m prep SDfile
Find this compound or compounds like it in BindingDB:
Activity Spreadsheet -- Enzyme Inhibition Constant Data from BindingDB
Found 2 hits for monomerid = 50083673
TargetMonoglyceride lipase(Homo sapiens (Human))
Universit£
Curated by ChEMBL
LigandPNGBDBM50083673(CHEMBL3422943)
Affinity DataIC50:  2.10E+4nM. Assay description: Inhibition of human recombinant MAGL using 4-nitrophenylacetate as substrate after 30 mins
In DepthDetails ArticlePubMed
TargetFatty-acid amide hydrolase 1(Homo sapiens (Human))
Universit£
Curated by ChEMBL
LigandPNGBDBM50083673(CHEMBL3422943)
Affinity DataIC50:  11nM. Assay description: Inhibition of human recombinant FAAH using AMC arachidonoyl amide as substrate after 30 mins by fluorescence assay
In DepthDetails ArticlePubMed