BDBM50083933 2-Amino-4-(3-chloro-4-fluoro-phenyl)-4-oxo-but-2-enoic acid::CHEMBL23717
SMILES OC(=O)C(=N)CC(=O)c1ccc(F)c(Cl)c1
InChI Key InChIKey=ABODFRBMGGHXRV-UHFFFAOYSA-N
Data  1 IC50
  Tab Delimited (TSV)   2D SDfile   Computed 3D by Vconf -m prep SDfile
Find this compound or compounds like it in BindingDB:
Activity Spreadsheet -- Enzyme Inhibition Constant Data from BindingDB
Found 1 hit for monomerid = 50083933
TargetKynurenine 3-monooxygenase(Rattus norvegicus)
Glaxo Wellcome Research And Development
Curated by ChEMBL
LigandPNGBDBM50083933(2-Amino-4-(3-chloro-4-fluoro-phenyl)-4-oxo-but-2-e...)
Affinity DataIC50:  820nM. Assay description: Inhibition of Kynurenine-3-hydroxylase enzyme isolated from the rat liver
In DepthDetails ArticlePubMed