BDBM50084264 CHEMBL3425965
SMILES FC(F)(F)CN1CCC(CC1)NC(=O)c1ccc(nc1)N1CCNC(=O)C1
InChI Key InChIKey=UQDSRIDQXXEUCF-UHFFFAOYSA-N
Data  1 IC50  1 Kd
  Tab Delimited (TSV)   2D SDfile   Computed 3D by Vconf -m prep SDfile
Find this compound or compounds like it in BindingDB:
Activity Spreadsheet -- Enzyme Inhibition Constant Data from BindingDB
Found 2 hits for monomerid = 50084264
TargetHematopoietic prostaglandin D synthase(Homo sapiens (Human))
Astrazeneca
Curated by ChEMBL
LigandPNGBDBM50084264(CHEMBL3425965)
Affinity DataIC50:  590nM. Assay description: Inhibition human HPGDS expressed in Escherichia coli assessed as reduction in GST enzymatic activity using MCBL and glutathione incubated for 30 mins...
In DepthDetails ArticlePubMed
TargetHematopoietic prostaglandin D synthase(Homo sapiens (Human))
Astrazeneca
Curated by ChEMBL
LigandPNGBDBM50084264(CHEMBL3425965)
Affinity DataKd:  1.00E+3nM. Assay description: Binding affinity to human HPGDS expressed in Escherichia coli using 1-phenylpyrazole-4-carboxylic acid/6-(3-fluorophenyl)pyridine-3-carboxamide as re...
In DepthDetails ArticlePubMed