BDBM50084282 (S)-2-(4'-amino-biphenyl-4-sulfonylamino)-3-methyl-butyric acid::2-(4'-Amino-biphenyl-4-sulfonylamino)-3-methyl-butyric acid::CHEMBL42114
SMILES CC(C)[C@H](NS(=O)(=O)c1ccc(cc1)-c1ccc(N)cc1)C(O)=O
InChI Key InChIKey=LKVAANCBUJLQIE-INIZCTEOSA-N
Data  7 IC50
  Tab Delimited (TSV)   2D SDfile   Computed 3D by Vconf -m prep SDfile
Find this compound or compounds like it in BindingDB:
Activity Spreadsheet -- Enzyme Inhibition Constant Data from BindingDB
Found 7 hits for monomerid = 50084282
TargetCollagenase 3(Homo sapiens (Human))
Parke-Davis Pharmaceutical Research
Curated by ChEMBL
LigandPNGBDBM50084282((S)-2-(4'-amino-biphenyl-4-sulfonylamino)-3-methyl...)
Affinity DataIC50:  105nM. Assay description: In vitro inhibition of human recombinant matrix metalloprotease-13 (MMP-13)
In DepthDetails ArticlePubMed
TargetStromelysin-1(Homo sapiens (Human))
Parke-Davis Pharmaceutical Research
Curated by ChEMBL
LigandPNGBDBM50084282((S)-2-(4'-amino-biphenyl-4-sulfonylamino)-3-methyl...)
Affinity DataIC50:  36nM. Assay description: In vitro inhibition of recombinant human matrix metalloprotease-3 (MMP-3)
In DepthDetails ArticlePubMed
TargetMatrix metalloproteinase-9(Homo sapiens (Human))
Parke-Davis Pharmaceutical Research
Curated by ChEMBL
LigandPNGBDBM50084282((S)-2-(4'-amino-biphenyl-4-sulfonylamino)-3-methyl...)
Affinity DataIC50:  2.00E+4nM. Assay description: In vitro inhibition of matrix metalloprotease-9 (MMP-9)
In DepthDetails ArticlePubMed
TargetMatrix metalloproteinase-9(Homo sapiens (Human))
Parke-Davis Pharmaceutical Research
Curated by ChEMBL
LigandPNGBDBM50084282((S)-2-(4'-amino-biphenyl-4-sulfonylamino)-3-methyl...)
Affinity DataIC50:  2.00E+4nM. Assay description: Inhibition of MMP9
In DepthDetails ArticlePubMed
TargetMatrilysin(Homo sapiens (Human))
Parke-Davis Pharmaceutical Research
Curated by ChEMBL
LigandPNGBDBM50084282((S)-2-(4'-amino-biphenyl-4-sulfonylamino)-3-methyl...)
Affinity DataIC50:  3.10E+4nM. Assay description: In vitro inhibition of matrix metalloprotease-7 (MMP-7)
In DepthDetails ArticlePubMed
TargetInterstitial collagenase(Homo sapiens (Human))
Parke-Davis Pharmaceutical Research
Curated by ChEMBL
LigandPNGBDBM50084282((S)-2-(4'-amino-biphenyl-4-sulfonylamino)-3-methyl...)
Affinity DataIC50:  2.60E+4nM. Assay description: In vitro inhibition of human recombinant matrix metalloprotease-1 (MMP-1)
In DepthDetails ArticlePubMed
Target72 kDa type IV collagenase(Homo sapiens (Human))
Parke-Davis Pharmaceutical Research
Curated by ChEMBL
LigandPNGBDBM50084282((S)-2-(4'-amino-biphenyl-4-sulfonylamino)-3-methyl...)
Affinity DataIC50:  36nM. Assay description: In vitro inhibition of matrix metalloprotease-2 (MMP-2)
In DepthDetails ArticlePubMed