BDBM50084394 CHEMBL3426145
SMILES CSc1ccnc(O[C@@H]2CC[C@@H](C)N(C2)C(=O)c2ccccc2-n2nccn2)c1
InChI Key InChIKey=GVNLLQCJDVUODJ-HZPDHXFCSA-N
Data  2 KI  2 IC50
  Tab Delimited (TSV)   2D SDfile   Computed 3D by Vconf -m prep SDfile
Find this compound or compounds like it in BindingDB:
Activity Spreadsheet -- Enzyme Inhibition Constant Data from BindingDB
Found 4 hits for monomerid = 50084394
TargetOrexin receptor type 2(Homo sapiens (Human))
Merck Research Laboratories
Curated by ChEMBL
LigandPNGBDBM50084394(CHEMBL3426145)
Affinity DataKi:  0.200nM. Assay description: Displacement of [3H]-(S)-N-(2-(1H-pyrrol-1-yl)phenyl)-1-(2-(1-methyl-1H-benzo[d]imidazol-2-ylthio)acetyl)pyrrolidine-2-carboxamide from human OX2R ex...
In DepthDetails ArticlePubMed
TargetOrexin/Hypocretin receptor type 1(Homo sapiens (Human))
Merck Research Laboratories
Curated by ChEMBL
LigandPNGBDBM50084394(CHEMBL3426145)
Affinity DataKi:  39nM. Assay description: Displacement of [3H]-(S)-N-(biphenyl-2-yl)-1-(2-(1-methyl-1H-benzo[d]imidazol-2-ylthio)acetyl)pyrrolidine-2-carboxamide from human OX1R expressed in ...
In DepthDetails ArticlePubMed
TargetOrexin receptor type 2(Homo sapiens (Human))
Merck Research Laboratories
Curated by ChEMBL
LigandPNGBDBM50084394(CHEMBL3426145)
Affinity DataIC50:  6.70nM. Assay description: Antagonist activity against human OX2R expressed in CHOK1 cells assessed as inhibition of orexin A-induced intercellular Ca2+ mobilization by FLIPR a...
In DepthDetails ArticlePubMed
TargetOrexin/Hypocretin receptor type 1(Homo sapiens (Human))
Merck Research Laboratories
Curated by ChEMBL
LigandPNGBDBM50084394(CHEMBL3426145)
Affinity DataIC50:  110nM. Assay description: Antagonist activity against human OX1R expressed in CHOK1 cells assessed as inhibition of orexin A-induced intercellular Ca2+ mobilization by FLIPR a...
In DepthDetails ArticlePubMed